BDBM50326538 (R)-2-(3-(2-(2-hydroxy-2-(4-hydroxy-3-(methylsulfonamido)phenyl)ethylamino)-2-methylpropyl)phenyl)-N-((4'-hydroxybiphenyl-4-yl)methyl)acetamide::CHEMBL1240966
SMILES CC(C)(Cc1cccc(CC(=O)NCc2ccc(cc2)-c2ccc(O)cc2)c1)NC[C@H](O)c1ccc(O)c(NS(C)(=O)=O)c1
InChI Key InChIKey=YJWDSNSUCGERRI-YTTGMZPUSA-N
Data  1 EC50
  Tab Delimited (TSV)   2D SDfile   Computed 3D by Vconf -m prep SDfile
Find this compound or compounds like it in BindingDB:
Activity Spreadsheet -- Enzyme Inhibition Constant Data from BindingDB
Found 1 hit for monomerid = 50326538
TargetBeta-2 adrenergic receptor(Homo sapiens (Human))
Pfizer
Curated by ChEMBL
LigandPNGBDBM50326538((R)-2-(3-(2-(2-hydroxy-2-(4-hydroxy-3-(methylsulfo...)
Affinity DataEC50:  0.240nM. Assay description: Agonist activity at human recombinant beta2 adrenergic receptor expressed in CHO cells assessed as elevation in cAMP level after 1 hr by flashplate m...
In DepthDetails ArticlePubMed